{"text_format":"1","workbook":"xlsx","n_sheets":10,"sheets":["UserManual","Model1Inputs","Model2Inputs","Results","Results_2","PriceVolatility","PriceVolatility_2","GraphPrep","GraphPrep_2","Lists"],"not_rendered":{"charts":4,"images":0,"macros":1,"external_links":0,"defined_names":54,"comments":0,"pivot_tables":2},"unopened":[],"bounds":{"document_bytes":16777216,"sheet_cells":100000,"rows_first":2000,"rows_last":500,"rows_between":2000,"halvings":0,"cell_chars":16384,"cell_head_chars":4096},"cells_cut":0,"cells_raw":0,"read":"whole","date_system":"1900"}

{"sheet":"UserManual","index":0,"n_rows":19,"n_cols":19,"rows_kept":19,"cut":false,"hidden":false,"merged":[[4,2,4,5],[17,4,17,14],[18,4,18,14],[6,2,7,14],[10,4,10,14],[11,4,11,14],[14,4,14,14],[15,4,15,14],[16,4,16,14],[13,4,13,14],[12,4,12,14]]}
[]
[]
[]
[]
[null,null,"User Manual"]
[]
[null,null,"This tool has been designed to quantify the cost-benefits of installing a shoreside connection point for you vessel(s). It works on basic assumptions which are the default international standards (EMEP/EEA Guidebook, 2016). Before this tool can be used there are a number of user inputs that need to be defined which are essential to the calculations. These are defined below;"]
[]
[]
[]
{"$rows_left_out":10}
{"sheet":"Model1Inputs","index":1,"n_rows":2,"n_cols":3,"rows_kept":2,"cut":false,"hidden":true,"merged":[]}
["Installation Cost (total) - £","Maintenance costs annually - £","Electricity cost - £/kWh"]
[125000,10000,0.08]

{"sheet":"Model2Inputs","index":2,"n_rows":2,"n_cols":3,"rows_kept":2,"cut":false,"hidden":true,"merged":[]}
["Payback period (yrs)","Electricity costs ","Maintenance%"]
[4,0.1,0.02]

{"sheet":"Results","index":3,"n_rows":48,"n_cols":14,"rows_kept":48,"cut":false,"hidden":true,"merged":[]}
[]
[]
[]
[]
[null,null,"Fuel consumed idling per year:",null,null,{"$f":"(n_HrsPerDay + n_Minsperday/60)*n_Enginepower*n_VesselNumbers*\n               IF(n_LoadChoice=\"Enter manually\",n_LoadManual,0.2)\n              *IF(n_SFCChoice=\"Enter manually\",n_SFCManual,INDEX(a_SFC,MATCH(n_Enginetype,a_EngineType,0),MATCH(n_Fuel,Lists!$G$3:$J$3,0)))\n              *(365.25*(n_DaysperWeek/7)-20)*10^-6","v":{"$error":"#N/A"}},"tonnes per year",null,null,null,{"$f":"INDEX(PriceVolatility!$B$31:$AK$31, MATCH(TRUE, PriceVolatility!$B$65:$AK$65, 0))","v":{"$error":"#N/A"}},{"$f":"INDEX(PriceVolatility!$B$31:$AK$31, MATCH(TRUE, PriceVolatility!$B$66:$AK$66, 0))","v":{"$error":"#N/A"}}]
[null,null,"Cost of fuel (this year):",null,"£",{"$f":"$F$5*n_FuelPrice*INDEX(Lists!$L$4:$L$6, MATCH(n_FuelUnit, a_FuelUnits, 0))","v":{"$error":"#N/A"}},"per year",null,null,"PAYBACK PERIOD:",{"$f":"IFERROR(IF(K5=L5, K5-n_Timestamp&\" years\", MIN($K$5:$L$5)-n_Timestamp&\"-\"&MAX($K$5:$L$5)-n_Timestamp&\" years\"), \"beyond 2035\")","v":"beyond 2035"}]
[]
[null,null,"Emissions mitigated:",null,null,null,null,null,null,"Fuel price scenario:","Existing policies"]
[null,null,"NOx",{"$f":"VLOOKUP(n_Enginetype&\"_\"&n_Fuel, a_EF, 4, FALSE)*n_AnnualFC*10^-3","v":{"$error":"#N/A"}},"tonnes/yr",null,null,null,null,"Electricity price scenario:","Existing policies"]
[null,null,"PM10",{"$f":"VLOOKUP(n_Enginetype&\"_\"&n_Fuel, a_EF, 5, FALSE)*n_AnnualFC","v":{"$error":"#N/A"}},"kg/yr"]
{"$rows_left_out":39}
{"sheet":"Results_2","index":4,"n_rows":48,"n_cols":15,"rows_kept":48,"cut":false,"hidden":true,"merged":[]}
[]
[]
[]
[]
[null,null,"Fuel consumed idling per year:",null,null,{"$f":"(n_HrsPerDay + n_Minsperday/60)*n_Enginepower*n_VesselNumbers*\n               IF(n_LoadChoice=\"Enter manually\",n_LoadManual,0.2)\n              *IF(n_SFCChoice=\"Enter manually\",n_SFCManual,INDEX(a_SFC,MATCH(n_Enginetype,a_EngineType,0),MATCH(n_Fuel,Lists!$G$3:$J$3,0)))\n              *(365.25*(n_DaysperWeek/7)-20)*10^-6","v":{"$error":"#N/A"}},"tonnes per year",null,null,null,{"$f":"INDEX(PriceVolatility!$B$31:$AK$31, MATCH(TRUE, PriceVolatility!$B$65:$AK$65, 0))","v":{"$error":"#N/A"}},{"$f":"INDEX(PriceVolatility!$B$31:$AK$31, MATCH(TRUE, PriceVolatility!$B$66:$AK$66, 0))","v":{"$error":"#N/A"}}]
[null,null,"Cost of fuel (this year):",null,"£",{"$f":"$F$5*n_FuelPrice*INDEX(Lists!$L$4:$L$6, MATCH(n_FuelUnit, a_FuelUnits, 0))","v":{"$error":"#N/A"}},"per year",null,null,"PAYBACK PERIOD:",{"$f":"Results_2!n_PaybackPeriod&\" years\"","v":"4 years"}]
[]
[null,null,"Emissions mitigated:",null,null,null,null,null,null,"Fuel price scenario:","Existing policies"]
[null,null,"NOx",{"$f":"VLOOKUP(n_Enginetype&\"_\"&n_Fuel, a_EF, 4, FALSE)*n_AnnualFC*10^-3","v":{"$error":"#N/A"}},"tonnes/yr",null,null,null,null,"Electricity price scenario:","Existing policies"]
[null,null,"PM10",{"$f":"VLOOKUP(n_Enginetype&\"_\"&n_Fuel, a_EF, 5, FALSE)*n_AnnualFC","v":{"$error":"#N/A"}},"kg/yr"]
{"$rows_left_out":39}
{"sheet":"PriceVolatility","index":5,"n_rows":82,"n_cols":41,"rows_kept":82,"cut":false,"hidden":true,"merged":[]}
["Processing explanations in this column"]
["|"]
["|","Timestamp",null,null,null,null,null,null,null,null,null,null,null,null,null,null,null,{"$f":"YEAR(NOW())","v":2019},null,"Fuel price",{"$f":"n_FuelPrice*INDEX(Lists!$L$4:$L$6, MATCH(n_FuelUnit, a_FuelUnits, 0))","v":0},"per tonne","Elec. Price",{"$f":"IF(AND(ISNUMBER(n_ElecPrice),n_ElecPrice>0),n_ElecPrice,INDEX($R$36:$AK$36,MATCH(n_Timestamp,$R$31:$AK$31,0))/100)","v":0.08},"per kWh"]
["V",null,null,null,null,null,null,null,null,null,null,null,null,null,null,null,null,"Source: BEIS UEP projections"]
[null,null,2001,{"$f":"C5+1","v":2002},{"$f":"D5+1","v":2003},2004,2005,2006,2007,2008,2009,2010,2011,2012,2013,2014,2015,2016,2017,2018,2019,2020,2021,2022,2023,2024,2025,2026,2027,2028,2029,2030,2031,2032,2033,2034,2035]
["1. BEIS UEP projected cost of fuels (£ per tonne)","Existing policies",2.1650474404056763,2.030180523604129,2.2674454588215358,2.4950661801430387,3.1204382652527527,3.6819015254359897,3.6611155812797045,5.28103022379526,4.2597306518592619,5.1248857187622434,6.248298950219989,6.4043864271092232,6.1649604988213156,5.5067308096614438,4.1363817037841066,2.9254771399813042,3.2395508898992995,3.3815296193809097,3.4875449872281727,3.6375539165004005,3.7849926563084035,3.8845664571813194,4.0280431144321946,4.170863713410121,4.3137360894267944,4.4115760119059733,4.5545530072961879,4.6975828498863335,4.7955813164228633,4.9387179407271322,4.9466547499107785,4.9546458676616663,4.9626916655926676,4.9707925178594596,4.9789488011779337]
[null,"Low price scenario",2.1650474404056763,2.030180523604129,2.2674454588215358,2.4950661801430387,3.1204382652527527,3.6819015254359897,3.6611155812797045,5.28103022379526,4.2597306518592619,5.1248857187622434,6.248298950219989,6.4043864271092232,6.1649604988213156,5.5067308096614438,4.1363817037841066,2.5648004610466129,2.2476900228288996,2.3445841674436734,2.4956841201577737,2.6006084645631642,2.7480472043711668,2.8476210052440845,2.9910976624949601,3.0888336766060474,3.231706052622723,3.3295459751019005,3.4725229704921161,3.5704682282154248,3.7135512796187937,3.811603319056224,3.8195401282398711,3.827531245990758,3.8355770439217585,3.8436778961885523,3.851834179507025]
[null,"High price scenario",2.1650474404056763,2.030180523604129,2.2674454588215358,2.4950661801430387,3.1204382652527527,3.6819015254359897,3.6611155812797045,5.28103022379526,4.2597306518592619,5.1248857187622434,6.248298950219989,6.4043864271092232,6.1649604988213156,5.5067308096614438,4.1363817037841066,3.5566613281170119,4.0059888326355173,4.2381367318507994,4.4343212694317353,4.6294147835708008,4.8670226931124745,5.056765663719065,5.2904114907036126,5.4783166745483731,5.7113582202987212,5.899367312511572,6.1325134776354595,6.320627905092441,6.5538801262294815,6.7421013354005845,6.7500381445842317,6.7580292623351195,6.766075060266119,6.7741759125329146,6.782332195851386]
[]
["2. Scaled time-series to account for which year we are in. So if timestamp year is 2019, cost projections are scaled to that year. Trends are used in the UEP in effect (£/t)","Existing policies",null,null,null,null,null,null,null,null,null,null,null,null,null,null,null,{"$f":"R6","v":2.9254771399813042},{"$f":"S6","v":3.2395508898992995},3.3815296193809097,3.4875449872281727,3.6375539165004005,3.7849926563084035,3.8845664571813194,4.0280431144321946,4.170863713410121,4.3137360894267944,4.4115760119059733,4.5545530072961879,4.6975828498863335,4.7955813164228633,4.9387179407271322,4.9466547499107785,4.9546458676616663,4.9626916655926676,4.9707925178594596,4.9789488011779337]
{"$rows_left_out":73}
{"sheet":"PriceVolatility_2","index":6,"n_rows":75,"n_cols":41,"rows_kept":75,"cut":false,"hidden":true,"merged":[]}
["Processing explanations in this column"]
["|"]
["|","Timestamp",null,null,null,null,null,null,null,null,null,null,null,null,null,null,null,{"$f":"YEAR(NOW())","v":2019},null,"Fuel price",{"$f":"n_FuelPrice*INDEX(Lists!$L$4:$L$6, MATCH(n_FuelUnit, a_FuelUnits, 0))","v":0},"per tonne","Elec. Price",{"$f":"IF(AND(ISNUMBER(n_ElecPrice),n_ElecPrice>0),n_ElecPrice,INDEX(#REF!,MATCH(n_Timestamp,#REF!,0))/100)","v":0.08},"per kWh"]
["V",null,null,null,null,null,null,null,null,null,null,null,null,null,null,null,null,"Source: BEIS UEP projections"]
[null,null,2001,{"$f":"C5+1","v":2002},{"$f":"D5+1","v":2003},2004,2005,2006,2007,2008,2009,2010,2011,2012,2013,2014,2015,2016,2017,2018,2019,2020,2021,2022,2023,2024,2025,2026,2027,2028,2029,2030,2031,2032,2033,2034,2035]
["1. BEIS UEP projected cost of fuels (£ per tonne)","Existing policies",2.1650474404056763,2.030180523604129,2.2674454588215358,2.4950661801430387,3.1204382652527527,3.6819015254359897,3.6611155812797045,5.28103022379526,4.2597306518592619,5.1248857187622434,6.248298950219989,6.4043864271092232,6.1649604988213156,5.5067308096614438,4.1363817037841066,2.9254771399813042,3.2395508898992995,3.3815296193809097,3.4875449872281727,3.6375539165004005,3.7849926563084035,3.8845664571813194,4.0280431144321946,4.170863713410121,4.3137360894267944,4.4115760119059733,4.5545530072961879,4.6975828498863335,4.7955813164228633,4.9387179407271322,4.9466547499107785,4.9546458676616663,4.9626916655926676,4.9707925178594596,4.9789488011779337]
[null,"Low price scenario",2.1650474404056763,2.030180523604129,2.2674454588215358,2.4950661801430387,3.1204382652527527,3.6819015254359897,3.6611155812797045,5.28103022379526,4.2597306518592619,5.1248857187622434,6.248298950219989,6.4043864271092232,6.1649604988213156,5.5067308096614438,4.1363817037841066,2.5648004610466129,2.2476900228288996,2.3445841674436734,2.4956841201577737,2.6006084645631642,2.7480472043711668,2.8476210052440845,2.9910976624949601,3.0888336766060474,3.231706052622723,3.3295459751019005,3.4725229704921161,3.5704682282154248,3.7135512796187937,3.811603319056224,3.8195401282398711,3.827531245990758,3.8355770439217585,3.8436778961885523,3.851834179507025]
[null,"High price scenario",2.1650474404056763,2.030180523604129,2.2674454588215358,2.4950661801430387,3.1204382652527527,3.6819015254359897,3.6611155812797045,5.28103022379526,4.2597306518592619,5.1248857187622434,6.248298950219989,6.4043864271092232,6.1649604988213156,5.5067308096614438,4.1363817037841066,3.5566613281170119,4.0059888326355173,4.2381367318507994,4.4343212694317353,4.6294147835708008,4.8670226931124745,5.056765663719065,5.2904114907036126,5.4783166745483731,5.7113582202987212,5.899367312511572,6.1325134776354595,6.320627905092441,6.5538801262294815,6.7421013354005845,6.7500381445842317,6.7580292623351195,6.766075060266119,6.7741759125329146,6.782332195851386]
[]
["2. Scaled time-series to account for which year we are in. So if timestamp year is 2019, cost projections are scaled to that year. Trends are used in the UEP in effect (£/t)","Existing policies",null,null,null,null,null,null,null,null,null,null,null,null,null,null,null,{"$f":"R6","v":2.9254771399813042},{"$f":"S6","v":3.2395508898992995},3.3815296193809097,3.4875449872281727,3.6375539165004005,3.7849926563084035,3.8845664571813194,4.0280431144321946,4.170863713410121,4.3137360894267944,4.4115760119059733,4.5545530072961879,4.6975828498863335,4.7955813164228633,4.9387179407271322,4.9466547499107785,4.9546458676616663,4.9626916655926676,4.9707925178594596,4.9789488011779337]
{"$rows_left_out":66}
{"sheet":"GraphPrep","index":7,"n_rows":122,"n_cols":16,"rows_kept":122,"cut":false,"hidden":true,"merged":[]}
[null,{"$f":"Results!$K$8","v":"Existing policies"},{"$f":"Results!$K$9","v":"Existing policies"}]
[null,null,null,null,null,null,null,null,null,null,null,null,"Electricity price scenario","(All)"]
[null,"Fuel price","Electricity price scenario","Year","Fuel costs","Shore-side costs","Colouring1","Colouring2","Colouring3","COLOURINGACTUAL","COLOURINGACTUAL"]
[null,"Existing policies",{"$f":"$C$1","v":"Existing policies"},{"$f":"n_Timestamp","v":2019},{"$f":"VLOOKUP(GraphPrep!$B4, PriceVolatility!$B$23:$AK$26, MATCH(GraphPrep!$D4, PriceVolatility!$B$23:$AK$23, 0), 0)","v":{"$error":"#N/A"}},{"$f":"VLOOKUP($C4, PriceVolatility!$B$54:$AK$57, MATCH(GraphPrep!$D4, PriceVolatility!$B$54:$AK$54, 0), 0)","v":135000},{"$f":"MIN(E4,F4)","v":{"$error":"#N/A"}},{"$f":"IF(E4>F4, E4, 0)","v":{"$error":"#N/A"}},{"$f":"IF(H4=0, F4, 0)","v":{"$error":"#N/A"}},{"$f":"IF(AND(H4=0, H5>0), I4, H4)","v":{"$error":"#N/A"}},{"$f":"IF(AND(I4=0, I3>0), H4, I4)","v":{"$error":"#N/A"}},null,"Row Labels","Sum of Fuel costs","Sum of Shore-side costs","Sum of Colouring1"]
[null,"Existing policies","Existing policies",{"$f":"D4+1","v":2020},{"$f":"VLOOKUP(GraphPrep!$B5, PriceVolatility!$B$23:$AK$26, MATCH(GraphPrep!$D5, PriceVolatility!$B$23:$AK$23, 0), 0)","v":{"$error":"#N/A"}},{"$f":"VLOOKUP($C5, PriceVolatility!$B$54:$AK$57, MATCH(GraphPrep!$D5, PriceVolatility!$B$54:$AK$54, 0), 0)","v":145000},{"$f":"MIN(E5,F5)","v":{"$error":"#N/A"}},{"$f":"IF(E5>F5, E5, 0)","v":{"$error":"#N/A"}},{"$f":"IF(H5=0, F5, 0)","v":{"$error":"#N/A"}},{"$error":"#N/A"},{"$f":"IF(AND(I5=0, I4>0), H5, I5)","v":{"$error":"#N/A"}},null,2019,8577.8343750000004,139103,8577.8343750000004]
[null,"Existing policies","Existing policies",{"$f":"D5+1","v":2021},{"$f":"VLOOKUP(GraphPrep!$B6, PriceVolatility!$B$23:$AK$26, MATCH(GraphPrep!$D6, PriceVolatility!$B$23:$AK$23, 0), 0)","v":{"$error":"#N/A"}},{"$f":"VLOOKUP($C6, PriceVolatility!$B$54:$AK$57, MATCH(GraphPrep!$D6, PriceVolatility!$B$54:$AK$54, 0), 0)","v":155000},{"$error":"#N/A"},{"$error":"#N/A"},{"$error":"#N/A"},{"$error":"#N/A"},{"$error":"#N/A"},null,2020,17524.625065912915,153333.3184269616,17524.625065912915]
[null,"Existing policies","Existing policies",2022,{"$f":"VLOOKUP(GraphPrep!$B7, PriceVolatility!$B$23:$AK$26, MATCH(GraphPrep!$D7, PriceVolatility!$B$23:$AK$23, 0), 0)","v":{"$error":"#N/A"}},{"$f":"VLOOKUP($C7, PriceVolatility!$B$54:$AK$57, MATCH(GraphPrep!$D7, PriceVolatility!$B$54:$AK$54, 0), 0)","v":165000},{"$error":"#N/A"},{"$error":"#N/A"},{"$error":"#N/A"},{"$error":"#N/A"},{"$error":"#N/A"},null,2021,26834.050531477704,167668.59764833871,26834.050531477704]
[null,"Existing policies","Existing policies",2023,{"$f":"VLOOKUP(GraphPrep!$B8, PriceVolatility!$B$23:$AK$26, MATCH(GraphPrep!$D8, PriceVolatility!$B$23:$AK$23, 0), 0)","v":{"$error":"#N/A"}},{"$f":"VLOOKUP($C8, PriceVolatility!$B$54:$AK$57, MATCH(GraphPrep!$D8, PriceVolatility!$B$54:$AK$54, 0), 0)","v":175000},{"$error":"#N/A"},{"$error":"#N/A"},{"$error":"#N/A"},{"$error":"#N/A"},{"$error":"#N/A"},null,2022,36388.383969586226,181985.39843254504,36388.383969586226]
[null,"Existing policies","Existing policies",2024,{"$f":"VLOOKUP(GraphPrep!$B9, PriceVolatility!$B$23:$AK$26, MATCH(GraphPrep!$D9, PriceVolatility!$B$23:$AK$23, 0), 0)","v":{"$error":"#N/A"}},{"$f":"VLOOKUP($C9, PriceVolatility!$B$54:$AK$57, MATCH(GraphPrep!$D9, PriceVolatility!$B$54:$AK$54, 0), 0)","v":185000},{"$error":"#N/A"},{"$error":"#N/A"},{"$error":"#N/A"},{"$f":"IF(AND(H9=0, H10>0), I9, H9)","v":{"$error":"#N/A"}},{"$error":"#N/A"},null,2023,46295.60719322689,196359.57307111446,46295.60719322689]
[null,"Existing policies","Existing policies",2025,{"$f":"VLOOKUP(GraphPrep!$B10, PriceVolatility!$B$23:$AK$26, MATCH(GraphPrep!$D10, PriceVolatility!$B$23:$AK$23, 0), 0)","v":{"$error":"#N/A"}},{"$f":"VLOOKUP($C10, PriceVolatility!$B$54:$AK$57, MATCH(GraphPrep!$D10, PriceVolatility!$B$54:$AK$54, 0), 0)","v":195000},{"$error":"#N/A"},{"$error":"#N/A"},{"$error":"#N/A"},{"$f":"IF(AND(H10=0, H11>0), I10, H10)","v":{"$error":"#N/A"}},{"$error":"#N/A"},null,2024,56554.10658616641,210846.09431310292,56554.10658616641]
{"$rows_left_out":113}
{"sheet":"GraphPrep_2","index":8,"n_rows":22,"n_cols":16,"rows_kept":22,"cut":false,"hidden":true,"merged":[]}
[null,{"$f":"Results_2!$K$8","v":"Existing policies"},{"$f":"Results_2!$K$9","v":"Existing policies"},null,null,null,null,null,null,null,null,null,"Fuel price","(All)"]
[null,null,null,null,null,null,null,null,null,null,null,null,"Electricity price scenario","(All)"]
[null,"Fuel price","Electricity price scenario","Year","Fuel costs","Shore-side costs","Colouring1","Colouring2","Colouring3","COLOURINGACTUAL","COLOURINGACTUAL"]
[null,"Existing policies",{"$f":"$C$1","v":"Existing policies"},{"$f":"n_Timestamp","v":2019},{"$f":"VLOOKUP(GraphPrep_2!$B4, PriceVolatility_2!$B$23:$AK$26, MATCH(GraphPrep_2!$D4, PriceVolatility_2!$B$23:$AK$23, 0), 0)","v":{"$error":"#N/A"}},{"$f":"INDEX(PriceVolatility_2!$W$55:$W$57,MATCH(GraphPrep_2!C4,PriceVolatility_2!$B$55:$B$57,0))*(1+PriceVolatility_2!$R$29 * [0]!n_PaybackPeriod)+VLOOKUP(GraphPrep_2!$C4, PriceVolatility_2!$B$49:$AK$52, MATCH(GraphPrep_2!$D4, PriceVolatility_2!$B$44:$AK$44, 0), FALSE)","v":{"$error":"#N/A"}},{"$f":"MIN(E4,F4)","v":{"$error":"#N/A"}},{"$f":"IF(H5>0, G4, IF(E4>F4, E4, 0))","v":{"$error":"#N/A"}},{"$f":"IF(H4=0, F4, 0)","v":{"$error":"#N/A"}},{"$f":"IF(AND(H4=0, H5>0), I4, H4)","v":{"$error":"#N/A"}},{"$f":"IF(AND(I4=0, I3>0), H4, I4)","v":{"$error":"#N/A"}},null,"Row Labels","Sum of Fuel costs","Sum of Shore-side costs","Sum of Colouring1"]
[null,"Existing policies","Existing policies",{"$f":"D4+1","v":2020},{"$f":"VLOOKUP(GraphPrep_2!$B5, PriceVolatility_2!$B$23:$AK$26, MATCH(GraphPrep_2!$D5, PriceVolatility_2!$B$23:$AK$23, 0), 0)","v":{"$error":"#N/A"}},{"$f":"INDEX(PriceVolatility_2!$W$55:$W$57,MATCH(GraphPrep_2!C5,PriceVolatility_2!$B$55:$B$57,0))*(1+PriceVolatility_2!$R$29 * [0]!n_PaybackPeriod)+VLOOKUP(GraphPrep_2!$C5, PriceVolatility_2!$B$49:$AK$52, MATCH(GraphPrep_2!$D5, PriceVolatility_2!$B$44:$AK$44, 0), FALSE)","v":{"$error":"#N/A"}},{"$f":"MIN(E5,F5)","v":{"$error":"#N/A"}},{"$f":"IF(H6>0, G5, IF(E5>F5, E5, 0))","v":{"$error":"#N/A"}},{"$f":"IF(H5=0, F5, 0)","v":{"$error":"#N/A"}},{"$error":"#N/A"},{"$f":"IF(AND(I5=0, I4>0), H5, I5)","v":{"$error":"#N/A"}},null,2019,60294.867187499993,312245.1292593893,60294.867187499993]
[null,"Existing policies","Existing policies",{"$f":"D5+1","v":2021},{"$f":"VLOOKUP(GraphPrep_2!$B6, PriceVolatility_2!$B$23:$AK$26, MATCH(GraphPrep_2!$D6, PriceVolatility_2!$B$23:$AK$23, 0), 0)","v":{"$error":"#N/A"}},{"$f":"INDEX(PriceVolatility_2!$W$55:$W$57,MATCH(GraphPrep_2!C6,PriceVolatility_2!$B$55:$B$57,0))*(1+PriceVolatility_2!$R$29 * [0]!n_PaybackPeriod)+VLOOKUP(GraphPrep_2!$C6, PriceVolatility_2!$B$49:$AK$52, MATCH(GraphPrep_2!$D6, PriceVolatility_2!$B$44:$AK$44, 0), FALSE)","v":{"$error":"#N/A"}},{"$error":"#N/A"},{"$f":"IF(H7>0, G6, IF(E6>F6, E6, 0))","v":{"$error":"#N/A"}},{"$error":"#N/A"},{"$error":"#N/A"},{"$error":"#N/A"},null,2020,123183.18291846856,315474.52412997157,123183.18291846856]
[null,"Existing policies","Existing policies",2022,{"$f":"VLOOKUP(GraphPrep_2!$B7, PriceVolatility_2!$B$23:$AK$26, MATCH(GraphPrep_2!$D7, PriceVolatility_2!$B$23:$AK$23, 0), 0)","v":{"$error":"#N/A"}},{"$f":"INDEX(PriceVolatility_2!$W$55:$W$57,MATCH(GraphPrep_2!C7,PriceVolatility_2!$B$55:$B$57,0))*(1+PriceVolatility_2!$R$29 * [0]!n_PaybackPeriod)+VLOOKUP(GraphPrep_2!$C7, PriceVolatility_2!$B$49:$AK$52, MATCH(GraphPrep_2!$D7, PriceVolatility_2!$B$44:$AK$44, 0), FALSE)","v":{"$error":"#N/A"}},{"$error":"#N/A"},{"$f":"IF(H8>0, G7, IF(E7>F7, E7, 0))","v":{"$error":"#N/A"}},{"$error":"#N/A"},{"$error":"#N/A"},{"$error":"#N/A"},null,2021,188620.51214390717,318784.04532129073,188620.51214390717]
[null,"Existing policies","Existing policies",2023,{"$f":"VLOOKUP(GraphPrep_2!$B8, PriceVolatility_2!$B$23:$AK$26, MATCH(GraphPrep_2!$D8, PriceVolatility_2!$B$23:$AK$23, 0), 0)","v":{"$error":"#N/A"}},{"$f":"INDEX(PriceVolatility_2!$W$55:$W$57,MATCH(GraphPrep_2!C8,PriceVolatility_2!$B$55:$B$57,0))*(1+PriceVolatility_2!$R$29 * [0]!n_PaybackPeriod)+VLOOKUP(GraphPrep_2!$C8, PriceVolatility_2!$B$49:$AK$52, MATCH(GraphPrep_2!$D8, PriceVolatility_2!$B$44:$AK$44, 0), FALSE)","v":{"$error":"#N/A"}},{"$error":"#N/A"},{"$f":"IF(H9>0, G8, IF(E8>F8, E8, 0))","v":{"$error":"#N/A"}},{"$error":"#N/A"},{"$error":"#N/A"},{"$error":"#N/A"},null,2022,255779.33575034261,322079.46020566253,255779.33575034261]
[null,"Existing policies","Existing policies",2024,{"$f":"VLOOKUP(GraphPrep_2!$B9, PriceVolatility_2!$B$23:$AK$26, MATCH(GraphPrep_2!$D9, PriceVolatility_2!$B$23:$AK$23, 0), 0)","v":{"$error":"#N/A"}},{"$f":"INDEX(PriceVolatility_2!$W$55:$W$57,MATCH(GraphPrep_2!C9,PriceVolatility_2!$B$55:$B$57,0))*(1+PriceVolatility_2!$R$29 * [0]!n_PaybackPeriod)+VLOOKUP(GraphPrep_2!$C9, PriceVolatility_2!$B$49:$AK$52, MATCH(GraphPrep_2!$D9, PriceVolatility_2!$B$44:$AK$44, 0), FALSE)","v":{"$error":"#N/A"}},{"$error":"#N/A"},{"$f":"IF(E9>F9, E9, 0)","v":{"$error":"#N/A"}},{"$error":"#N/A"},{"$f":"IF(AND(H9=0, H10>0), I9, H9)","v":{"$error":"#N/A"}},{"$error":"#N/A"},null,2023,325418.67388064187,325418.67388064187,325418.67388064187]
[null,"Existing policies","Existing policies",2025,{"$f":"VLOOKUP(GraphPrep_2!$B10, PriceVolatility_2!$B$23:$AK$26, MATCH(GraphPrep_2!$D10, PriceVolatility_2!$B$23:$AK$23, 0), 0)","v":{"$error":"#N/A"}},{"$f":"INDEX(PriceVolatility_2!$W$55:$W$57,MATCH(GraphPrep_2!C10,PriceVolatility_2!$B$55:$B$57,0))*(1+PriceVolatility_2!$R$29 * [0]!n_PaybackPeriod)+VLOOKUP(GraphPrep_2!$C10, PriceVolatility_2!$B$49:$AK$52, MATCH(GraphPrep_2!$D10, PriceVolatility_2!$B$44:$AK$44, 0), FALSE)","v":{"$error":"#N/A"}},{"$error":"#N/A"},{"$f":"IF(E10>F10, E10, 0)","v":{"$error":"#N/A"}},{"$error":"#N/A"},{"$f":"IF(AND(H10=0, H11>0), I10, H10)","v":{"$error":"#N/A"}},{"$error":"#N/A"},null,2024,397527.18418751494,328843.65215019556,328843.65215019556]
{"$rows_left_out":13}
{"sheet":"Lists","index":9,"n_rows":29,"n_cols":13,"rows_kept":29,"cut":false,"hidden":true,"merged":[]}
[]
[null,null,null,null,null,null,null,null,"a_SFC"]
[null,"a_FuelType","a_FuelDensity","a_CEF","a_SO2EF","a_Choice","a_EngineType","Marine diesel","Marine gas oil","Low-sulphur heavy fuel oil","a_FuelUnits","a_Multiplier","a_PriceScenario"]
[null,"<please select>",null,null,null,"<please select>","<please select>",null,null,null,"kg",1000,"<please select>"]
[null,"Marine diesel",1171,{"$f":"864*44/12","v":3168},1.4999999999999999E-2,"Use model defaults","Gas Turbine",319,319,336,"tonne",1,"Existing policies"]
[null,"Marine gas oil",1171,{"$f":"864*44/12","v":3168},1.6E-2,"Enter manually","High-speed",223,223,234,"litre",{"$f":"INDEX(a_FuelDensity, MATCH(n_Fuel, a_FuelType, 0))","v":0},"Low price scenario"]
[null,"Low-sulphur heavy fuel oil",1012,{"$f":"849*44/12","v":3113},27,null,"Medium-speed",223,223,234,null,null,"High price scenario"]
[null,null,null,null,null,null,"Slow-speed",204,204,215]
[null,null,null,null,null,null,"Steam turbine",319,319,336]
[]
{"$rows_left_out":19}